Reaction Details
TargetPhosphodiesterase
LigandBDBM50148194
Substrate/Competitorn/a
Meas. Tech.ChEMBL_1553554 (CHEMBL3769086)
IC50 316±n/a nM
Citation Veerman, Jvan den Bergh, TOrrling, KMJansen, CCos, PMaes, LChatelain, EIoset, JREdink, EETenor, HSeebeck, Tde Esch, ILeurs, RSterk, GJ Synthesis and evaluation of analogs of the phenylpyridazinone NPD-001 as potent trypanosomal TbrPDEB1 phosphodiesterase inhibitors and in vitro trypanocidals. Bioorg Med Chem24:1573-81 (2016) 
 
Phosphodiesterase
Name:Phosphodiesterase
Type:Protein
Mol. Mass.:103683.20
Organism:Trypanosoma brucei
Description:n/a
Residue:930
BDBM50148194
NameBDBM50148194
Synonyms:CHEMBL3763456
TypeSmall organic molecule
Emp. Form.C23H30N2O3
Mol. Mass.382.4959
SMILES[H][C@@]12CC=CC[C@]1([H])C(=NN(C1CCCCCC1)C2=O)c1ccc(OC)c(OC)c1