Reaction Details
TargetPhosphodiesterase
LigandBDBM50148249
Substrate/Competitorn/a
Meas. Tech.ChEMBL_1553554 (CHEMBL3769086)
IC50 79±n/a nM
Citation Veerman, Jvan den Bergh, TOrrling, KMJansen, CCos, PMaes, LChatelain, EIoset, JREdink, EETenor, HSeebeck, Tde Esch, ILeurs, RSterk, GJ Synthesis and evaluation of analogs of the phenylpyridazinone NPD-001 as potent trypanosomal TbrPDEB1 phosphodiesterase inhibitors and in vitro trypanocidals. Bioorg Med Chem24:1573-81 (2016) 
 
Phosphodiesterase
Name:Phosphodiesterase
Type:Protein
Mol. Mass.:103683.20
Organism:Trypanosoma brucei
Description:n/a
Residue:930
BDBM50148249
NameBDBM50148249
Synonyms:CHEMBL3763352
TypeSmall organic molecule
Emp. Form.C25H34N2O4
Mol. Mass.426.5485
SMILES[H][C@@]12CC=CC[C@]1([H])C(=NN(C1CCCCCC1)C2=O)c1ccc(OC)c(OCCOC)c1