Reaction Details
TargetKappa-type opioid receptor
LigandBDBM50148259
Substrate/Competitorn/a
Meas. Tech.ChEMBL_1553560 (CHEMBL3769092)
Ki 386±n/a nM
Citation Adamska, AKluczyk, ACerlesi, MCCalo, GJanecka, ABorics, A Synthesis, biological evaluation and structural analysis of novel peripherally active morphiceptin analogs. Bioorg Med Chem24:1582-8 (2016) 
 
Kappa-type opioid receptor
Name:Kappa-type opioid receptor
Type:G Protein-Coupled Receptor (GPCR)
Mol. Mass.:42744.99
Organism:Cavia porcellus (domestic guinea pig)
Description:P41144
Residue:380
BDBM50148259
NameBDBM50148259
Synonyms:CHEMBL3765406
TypeSmall organic molecule
Emp. Form.C28H31F4N5O5
Mol. Mass.593.5699
SMILESN[C@@H](Cc1ccc(O)cc1)C(=O)N1CC(F)(F)C[C@H]1C(=O)N[C@@H](Cc1ccccc1)C(=O)N1CC(F)(F)C[C@@H]1C(N)=O