Reaction Details
TargetMu-type opioid receptor
LigandBDBM50148257
Substrate/Competitorn/a
Meas. Tech.ChEMBL_1553735 (CHEMBL3766803)
EC50 20±n/a nM
Citation Adamska, AKluczyk, ACerlesi, MCCalo, GJanecka, ABorics, A Synthesis, biological evaluation and structural analysis of novel peripherally active morphiceptin analogs. Bioorg Med Chem24:1582-8 (2016) 
 
Mu-type opioid receptor
Name:Mu-type opioid receptor
Type:G Protein-Coupled Receptor (GPCR)
Mol. Mass.:44789.51
Organism:Homo sapiens (Human)
Description:P35372
Residue:400
BDBM50148257
NameBDBM50148257
Synonyms:CHEMBL3764219
TypeSmall organic molecule
Emp. Form.C28H33F2N5O5
Mol. Mass.557.5889
SMILESN[C@@H](Cc1ccc(O)cc1)C(=O)N1CCC[C@H]1C(=O)N[C@@H](Cc1ccccc1)C(=O)N1CC(F)(F)C[C@@H]1C(N)=O