Reaction Details
TargetGlycylpeptide N-tetradecanoyltransferase 1
LigandBDBM50148267
Substrate/Competitorn/a
Meas. Tech.ChEMBL_1556710 (CHEMBL3773953)
Ki 70±n/a nM
Citation Rackham, MDYu, ZBrannigan, JAHeal, WPPaape, DBarker, KVWilkinson, AJSmith, DFLeatherbarrow, RJTate, EW Discovery of high affinity inhibitors of Leishmania donovani N-myristoyltransferase. Medchemcomm6:1761-1766 (2016) Glycylpeptide N-tetradecanoyltransferase 1
Name:Glycylpeptide N-tetradecanoyltransferase 1
Type:Enzyme
Mol. Mass.:56814.10
Organism:Homo sapiens (Human)
Description:P30419
Residue:496
BDBM50148267
NameBDBM50148267
Synonyms:CHEMBL3770442
TypeSmall organic molecule
Emp. Form.C21H22ClN3O3
Mol. Mass.399.871
SMILESCOc1cccc(Cc2noc(n2)-c2cc(Cl)ccc2OC2CCNCC2)c1