Reaction Details
TargetGlycylpeptide N-tetradecanoyltransferase 1
LigandBDBM50148269
Substrate/Competitorn/a
Meas. Tech.ChEMBL_1556710 (CHEMBL3773953)
Ki 20±n/a nM
Citation Rackham, MDYu, ZBrannigan, JAHeal, WPPaape, DBarker, KVWilkinson, AJSmith, DFLeatherbarrow, RJTate, EW Discovery of high affinity inhibitors of Leishmania donovani N-myristoyltransferase. Medchemcomm6:1761-1766 (2016) Glycylpeptide N-tetradecanoyltransferase 1
Name:Glycylpeptide N-tetradecanoyltransferase 1
Type:Enzyme
Mol. Mass.:56814.10
Organism:Homo sapiens (Human)
Description:P30419
Residue:496
BDBM50148269
NameBDBM50148269
Synonyms:CHEMBL3770219
TypeSmall organic molecule
Emp. Form.C20H24ClN5O2
Mol. Mass.401.89
SMILESCc1nn(C)c(C)c1Cc1nnc(o1)-c1cc(Cl)ccc1OC1CCNCC1