Reaction Details
TargetTranscription intermediary factor 1-alpha
LigandBDBM50148464
Substrate/Competitorn/a
Meas. Tech.ChEMBL_1558044 (CHEMBL3771488)
IC50 3690±n/a nM
Citation Bennett, JFedorov, OTallant, CMonteiro, OMeier, JGamble, VSavitsky, PNunez-Alonso, GAHaendler, BRogers, CBrennan, PEMüller, SKnapp, S Discovery of a Chemical Tool Inhibitor Targeting the Bromodomains of TRIM24 and BRPF. J Med Chem59:1642-7 (2016) 
 
Transcription intermediary factor 1-alpha
Name:Transcription intermediary factor 1-alpha
Type:PROTEIN
Mol. Mass.:116839.55
Organism:Homo sapiens (Human)
Description:ChEMBL_107998
Residue:1050
BDBM50148464
NameBDBM50148464
Synonyms:CHEMBL3771106
TypeSmall organic molecule
Emp. Form.C20H23N3O4S
Mol. Mass.401.479
SMILESCn1c2ccc(NS(=O)(=O)c3ccc4OC(C)(C)CCc4c3)cc2n(C)c1=O