Reaction Details
TargetPeregrin
LigandBDBM50148465
Substrate/Competitorn/a
Meas. Tech.ChEMBL_1558045 (CHEMBL3771489)
IC50 290±n/a nM
Citation Bennett, JFedorov, OTallant, CMonteiro, OMeier, JGamble, VSavitsky, PNunez-Alonso, GAHaendler, BRogers, CBrennan, PEMüller, SKnapp, S Discovery of a Chemical Tool Inhibitor Targeting the Bromodomains of TRIM24 and BRPF. J Med Chem59:1642-7 (2016) 
 
Peregrin
Name:Peregrin
Type:PROTEIN
Mol. Mass.:137524.47
Organism:Homo sapiens (Human)
Description:ChEMBL_108054
Residue:1214
BDBM50148465
NameBDBM50148465
Synonyms:CHEMBL3771151
TypeSmall organic molecule
Emp. Form.C18H19N3O3S
Mol. Mass.357.427
SMILESCn1c2ccc(NS(=O)(=O)c3ccc4CCCc4c3)cc2n(C)c1=O