Reaction Details
TargetBromodomain-containing protein 1
LigandBDBM50148466
Substrate/Competitorn/a
Meas. Tech.ChEMBL_1558046 (CHEMBL3771490)
IC50>10000±n/a nM
Citation Bennett, JFedorov, OTallant, CMonteiro, OMeier, JGamble, VSavitsky, PNunez-Alonso, GAHaendler, BRogers, CBrennan, PEMüller, SKnapp, S Discovery of a Chemical Tool Inhibitor Targeting the Bromodomains of TRIM24 and BRPF. J Med Chem59:1642-7 (2016) 
 
Bromodomain-containing protein 1
Name:Bromodomain-containing protein 1
Type:PROTEIN
Mol. Mass.:119557.65
Organism:Homo sapiens (Human)
Description:ChEMBL_105349
Residue:1058
BDBM50148466
NameBDBM50148466
Synonyms:CHEMBL3771239
TypeSmall organic molecule
Emp. Form.C21H25N3O7S
Mol. Mass.463.504
SMILESCO[C@@]1(C)Oc2ccc(cc2OC1(C)OC)S(=O)(=O)Nc1ccc2n(C)c(=O)n(C)c2c1