Reaction Details
TargetBromodomain-containing protein 1
LigandBDBM50148469
Substrate/Competitorn/a
Meas. Tech.ChEMBL_1558046 (CHEMBL3771490)
IC50 5160±n/a nM
Citation Bennett, JFedorov, OTallant, CMonteiro, OMeier, JGamble, VSavitsky, PNunez-Alonso, GAHaendler, BRogers, CBrennan, PEMüller, SKnapp, S Discovery of a Chemical Tool Inhibitor Targeting the Bromodomains of TRIM24 and BRPF. J Med Chem59:1642-7 (2016) 
 
Bromodomain-containing protein 1
Name:Bromodomain-containing protein 1
Type:PROTEIN
Mol. Mass.:119557.65
Organism:Homo sapiens (Human)
Description:ChEMBL_105349
Residue:1058
BDBM50148469
NameBDBM50148469
Synonyms:CHEMBL3770810
TypeSmall organic molecule
Emp. Form.C23H23N3O4S
Mol. Mass.437.511
SMILESCc1ccc(cc1C)S(=O)(=O)Nc1cc2n(C)c(=O)n(C)c2cc1Oc1ccccc1