Reaction Details
TargetBromodomain-containing protein 1
LigandBDBM50148480
Substrate/Competitorn/a
Meas. Tech.ChEMBL_1558046 (CHEMBL3771490)
IC50 3580±n/a nM
Citation Bennett, JFedorov, OTallant, CMonteiro, OMeier, JGamble, VSavitsky, PNunez-Alonso, GAHaendler, BRogers, CBrennan, PEMüller, SKnapp, S Discovery of a Chemical Tool Inhibitor Targeting the Bromodomains of TRIM24 and BRPF. J Med Chem59:1642-7 (2016) 
 
Bromodomain-containing protein 1
Name:Bromodomain-containing protein 1
Type:PROTEIN
Mol. Mass.:119557.65
Organism:Homo sapiens (Human)
Description:ChEMBL_105349
Residue:1058
BDBM50148480
NameBDBM50148480
Synonyms:CHEMBL3770456
TypeSmall organic molecule
Emp. Form.C23H23N3O6S
Mol. Mass.469.51
SMILESCOc1ccc(Oc2cc3n(C)c(=O)n(C)c3cc2NS(=O)(=O)c2ccc(OC)cc2)cc1