Reaction Details
TargetBromodomain-containing protein 1
LigandBDBM50148482
Substrate/Competitorn/a
Meas. Tech.ChEMBL_1558046 (CHEMBL3771490)
IC50>10000±n/a nM
Citation Bennett, JFedorov, OTallant, CMonteiro, OMeier, JGamble, VSavitsky, PNunez-Alonso, GAHaendler, BRogers, CBrennan, PEMüller, SKnapp, S Discovery of a Chemical Tool Inhibitor Targeting the Bromodomains of TRIM24 and BRPF. J Med Chem59:1642-7 (2016) 
 
Bromodomain-containing protein 1
Name:Bromodomain-containing protein 1
Type:PROTEIN
Mol. Mass.:119557.65
Organism:Homo sapiens (Human)
Description:ChEMBL_105349
Residue:1058
BDBM50148482
NameBDBM50148482
Synonyms:CHEMBL3769732
TypeSmall organic molecule
Emp. Form.C25H27N3O6S
Mol. Mass.497.563
SMILESCCCOc1ccc(cc1)S(=O)(=O)Nc1cc2n(C)c(=O)n(C)c2cc1Oc1ccc(OC)cc1