Reaction Details
TargetRho-associated protein kinase 2
LigandBDBM50148577
Substrate/Competitorn/a
Meas. Tech.ChEMBL_1556366 (CHEMBL3772097)
IC50 140±n/a nM
Citation Donegan, RKLieberman, RL Discovery of Molecular Therapeutics for Glaucoma: Challenges, Successes, and Promising Directions. J Med Chem59:788-809 (2016) 
 
Rho-associated protein kinase 2
Name:Rho-associated protein kinase 2
Type:Protein
Mol. Mass.:160885.43
Organism:Homo sapiens (Human)
Description:O75116
Residue:1388
BDBM50148577
NameBDBM50148577
Synonyms:CHEMBL1994526
TypeSmall organic molecule
Emp. Form.C14H21N3O
Mol. Mass.247.336
SMILESCC(N)C1CCC(CC1)C(=O)Nc1ccncc1