Reaction Details
TargetRho-associated protein kinase 2
LigandBDBM50148578
Substrate/Competitorn/a
Meas. Tech.ChEMBL_1556366 (CHEMBL3772097)
IC50 1.5±n/a nM
Citation Donegan, RKLieberman, RL Discovery of Molecular Therapeutics for Glaucoma: Challenges, Successes, and Promising Directions. J Med Chem59:788-809 (2016) 
 
Rho-associated protein kinase 2
Name:Rho-associated protein kinase 2
Type:Protein
Mol. Mass.:160885.43
Organism:Homo sapiens (Human)
Description:O75116
Residue:1388
BDBM50148578
NameBDBM50148578
Synonyms:CHEMBL3770730
TypeSmall organic molecule
Emp. Form.C17H15N3O
Mol. Mass.277.3205
SMILESNC(C(=O)Nc1ccc2cnccc2c1)c1ccccc1