Reaction Details
TargetAdenosine receptor A3
LigandBDBM14487
Substrate/Competitorn/a
Meas. Tech.ChEMBL_1556370 (CHEMBL3772101)
EC50 290±n/a nM
Citation Donegan, RKLieberman, RL Discovery of Molecular Therapeutics for Glaucoma: Challenges, Successes, and Promising Directions. J Med Chem59:788-809 (2016) 
 
Adenosine receptor A3
Name:Adenosine receptor A3
Type:G Protein-Coupled Receptor (GPCR)
Mol. Mass.:36197.32
Organism:Homo sapiens (Human)
Description:P0DMS8
Residue:318
BDBM14487
NameBDBM14487
Synonyms:(2R,3R,4S,5R)-2-(6-amino-9H-purin-9-yl)-5-(hydroxymethyl)oxolane-3,4-diol Adenosine N6-Methylado cid_191 | cid_60961
TypeNucleoside or nucleotide
Emp. Form.C10H13N5O4
Mol. Mass.267.2413
SMILESNc1ncnc2n(cnc12)[C@@H]1O[C@H](CO)[C@@H](O)[C@H]1O