Reaction Details
TargetAdenosine receptor A2a
LigandBDBM50453216
Substrate/Competitorn/a
Meas. Tech.ChEMBL_1556377 (CHEMBL3772108)
Ki 32±n/a nM
Citation Donegan, RKLieberman, RL Discovery of Molecular Therapeutics for Glaucoma: Challenges, Successes, and Promising Directions. J Med Chem59:788-809 (2016) 
 
Adenosine receptor A2a
Name:Adenosine receptor A2a
Type:G Protein-Coupled Receptor (GPCR)
Mol. Mass.:44716.46
Organism:Homo sapiens (Human)
Description:P29274
Residue:412
BDBM50453216
NameBDBM50453216
Synonyms:2-(l-hexyn-l-yl)adenosine (8, YT-146) | CHEMBL2113496
TypeSmall organic molecule
Emp. Form.C18H25N5O4
Mol. Mass.375.4222
SMILESCCCCCCC#Cc1nc(N)c2ncn([C@@H]3O[C@H](CO)[C@@H](O)[C@H]3O)c2n1