Reaction Details
TargetAdenosine receptor A2a
LigandBDBM50148599
Substrate/Competitorn/a
Meas. Tech.ChEMBL_1556377 (CHEMBL3772108)
Ki 49±n/a nM
Citation Donegan, RKLieberman, RL Discovery of Molecular Therapeutics for Glaucoma: Challenges, Successes, and Promising Directions. J Med Chem59:788-809 (2016) 
 
Adenosine receptor A2a
Name:Adenosine receptor A2a
Type:G Protein-Coupled Receptor (GPCR)
Mol. Mass.:44716.46
Organism:Homo sapiens (Human)
Description:P29274
Residue:412
BDBM50148599
NameBDBM50148599
Synonyms:CHEMBL3770782
TypeSmall organic molecule
Emp. Form.C17H20N6O4
Mol. Mass.372.3785
SMILESNc1nc(nc2n(cnc12)[C@@H]1O[C@H](CO)[C@@H](O)[C@H]1O)C#CCCCCC#N