Reaction Details
TargetTransmembrane domain-containing protein TMIGD3
LigandBDBM50074225
Substrate/Competitorn/a
Meas. Tech.ChEMBL_1556380 (CHEMBL3772111)
Ki 19±n/a nM
Citation Donegan, RKLieberman, RL Discovery of Molecular Therapeutics for Glaucoma: Challenges, Successes, and Promising Directions. J Med Chem59:788-809 (2016) 
 
Transmembrane domain-containing protein TMIGD3
Name:Transmembrane domain-containing protein TMIGD3
Type:PROTEIN
Mol. Mass.:30335.79
Organism:Homo sapiens (Human)
Description:ChEMBL_114868
Residue:266
BDBM50074225
NameBDBM50074225
Synonyms:6-Ethyl-5-ethylsulfanylcarbonyl-2-phenyl-4-propyl-nicotinic acid propyl ester | CHEMBL111545
TypeSmall organic molecule
Emp. Form.C23H29NO3S
Mol. Mass.399.546
SMILESCCCOC(=O)c1c(CCC)c(C(=O)SCC)c(CC)nc1-c1ccccc1