Reaction Details
TargetAdenosine receptor A3
LigandBDBM50148602
Substrate/Competitorn/a
Meas. Tech.ChEMBL_1556381 (CHEMBL3772112)
Ki 910±n/a nM
Citation Donegan, RKLieberman, RL Discovery of Molecular Therapeutics for Glaucoma: Challenges, Successes, and Promising Directions. J Med Chem59:788-809 (2016) 
 
Adenosine receptor A3
Name:Adenosine receptor A3
Type:G Protein-Coupled Receptor (GPCR)
Mol. Mass.:36197.32
Organism:Homo sapiens (Human)
Description:P0DMS8
Residue:318
BDBM50148602
NameBDBM50148602
Synonyms:CHEMBL3770194
TypeSmall organic molecule
Emp. Form.C22H22ClIN6O6
Mol. Mass.628.804
SMILESCNC(=O)[C@H]1O[C@H]([C@H](OC(C)=O)[C@@H]1OC(C)=O)n1cnc2c(NCc3cccc(I)c3)nc(Cl)nc12