Reaction Details
TargetCalmodulin-domain protein kinase 1
LigandBDBM50148750
Substrate/Competitorn/a
Meas. Tech.ChEMBL_1557115 (CHEMBL3773067)
IC50 4.6±n/a nM
Citation Huang, WOjo, KKZhang, ZRivas, KVidadala, RSScheele, SDeRocher, AEChoi, RHulverson, MABarrett, LKBruzual, ISiddaramaiah, LKKerchner, KMKurnick, MDFreiberg, GMKempf, DHol, WGMerritt, EANeckermann, Gde Hostos, ELIsoherranen, NMaly, DJParsons, MDoggett, JSVan Voorhis, WCFan, E SAR Studies of 5-Aminopyrazole-4-carboxamide Analogues as Potent and Selective Inhibitors of Toxoplasma gondii CDPK1. ACS Med Chem Lett6:1184-1189 (2015) 
 
Calmodulin-domain protein kinase 1
Name:Calmodulin-domain protein kinase 1
Type:Enzyme Catalytic Domain
Mol. Mass.:57248.42
Organism:Toxoplasma gondii
Description:n/a
Residue:507
BDBM50148750
NameBDBM50148750
Synonyms:CHEMBL3770299 US9956214, Compound 1643
TypeSmall organic molecule
Emp. Form.C20H23N5O2
Mol. Mass.365.4289
SMILESCC(C)(C)n1nc(c(C(N)=O)c1N)-c1ccc2nc(OC3CC3)ccc2c1