Reaction Details
TargetPhosphatidylinositol 4,5-bisphosphate 3-kinase catalytic subunit alpha isoform
LigandBDBM50149102
Substrate/Competitorn/a
Meas. Tech.ChEBML_1557711
IC50 778±n/a nM
Citation Peng, WTu, ZCLong, ZJLiu, QLu, G Discovery of 2-(2-aminopyrimidin-5-yl)-4-morpholino-N-(pyridin-3-yl)quinazolin-7-amines as novel PI3K/mTOR inhibitors and anticancer agents. Eur J Med Chem108:644-54 (2016) 
 
Phosphatidylinositol 4,5-bisphosphate 3-kinase catalytic subunit alpha isoform
Name:Phosphatidylinositol 4,5-bisphosphate 3-kinase catalytic subunit alpha isoform
Type:Enzyme Subunit
Mol. Mass.:124294.87
Organism:Homo sapiens (Human)
Description:P42336
Residue:1068
BDBM50149102
NameBDBM50149102
Synonyms:CHEMBL3770944
TypeSmall organic molecule
Emp. Form.C21H20N8O
Mol. Mass.400.4365
SMILESNc1ncc(cn1)-c1nc(N2CCOCC2)c2cccc(Nc3ccncc3)c2n1