Reaction Details
TargetProlyl hydroxylase EGLN3
LigandBDBM50149925
Substrate/Competitorn/a
Meas. Tech.ChEMBL_1558377 (CHEMBL3772969)
IC50<100000±n/a nM
Citation Westaway, SMPreston, AGBarker, MDBrown, FBrown, JACampbell, MChung, CWDrewes, GEagle, RGarton, NGordon, LHaslam, CHayhow, TGHumphreys, PGJoberty, GKatso, RKruidenier, LLeveridge, MPemberton, MRioja, ISeal, GAShipley, TSingh, OSuckling, CJTaylor, JThomas, PWilson, DMLee, KPrinjha, RK Cell Penetrant Inhibitors of the KDM4 and KDM5 Families of Histone Lysine Demethylases. 2. Pyrido[3,4-d]pyrimidin-4(3H)-one Derivatives. J Med Chem59:1370-87 (2016) 
 
Prolyl hydroxylase EGLN3
Name:Prolyl hydroxylase EGLN3
Type:Protein
Mol. Mass.:27265.54
Organism:Homo sapiens (Human)
Description:Q9H6Z9
Residue:239
BDBM50149925
NameBDBM50149925
Synonyms:CHEMBL3770740
TypeSmall organic molecule
Emp. Form.C13H8ClN3O3
Mol. Mass.289.674
SMILESOc1cc(Oc2nc3cnccc3c(=O)[nH]2)ccc1Cl