Reaction Details
TargetLysine-specific demethylase 4D
LigandBDBM195612
Substrate/Competitorn/a
Meas. Tech.ChEMBL_1558374 (CHEMBL3772966)
IC50 398±n/a nM
Citation Westaway, SMPreston, AGBarker, MDBrown, FBrown, JACampbell, MChung, CWDrewes, GEagle, RGarton, NGordon, LHaslam, CHayhow, TGHumphreys, PGJoberty, GKatso, RKruidenier, LLeveridge, MPemberton, MRioja, ISeal, GAShipley, TSingh, OSuckling, CJTaylor, JThomas, PWilson, DMLee, KPrinjha, RK Cell Penetrant Inhibitors of the KDM4 and KDM5 Families of Histone Lysine Demethylases. 2. Pyrido[3,4-d]pyrimidin-4(3H)-one Derivatives. J Med Chem59:1370-87 (2016) 
 
Lysine-specific demethylase 4D
Name:Lysine-specific demethylase 4D
Type:PROTEIN
Mol. Mass.:58627.79
Organism:Homo sapiens (Human)
Description:ChEMBL_102441
Residue:523
BDBM195612
NameBDBM195612
Synonyms:GSK467
TypeSmall organic molecule
Emp. Form.C17H13N5O2
Mol. Mass.319.3174
SMILESO=c1[nH]c(Oc2cnn(Cc3ccccc3)c2)nc2cnccc12