Reaction Details
TargetLysine-specific demethylase 4C
LigandBDBM50149918
Substrate/Competitorn/a
Meas. Tech.ChEMBL_1558378 (CHEMBL3772970)
IC50 2512±n/a nM
Citation Westaway, SMPreston, AGBarker, MDBrown, FBrown, JACampbell, MChung, CWDrewes, GEagle, RGarton, NGordon, LHaslam, CHayhow, TGHumphreys, PGJoberty, GKatso, RKruidenier, LLeveridge, MPemberton, MRioja, ISeal, GAShipley, TSingh, OSuckling, CJTaylor, JThomas, PWilson, DMLee, KPrinjha, RK Cell Penetrant Inhibitors of the KDM4 and KDM5 Families of Histone Lysine Demethylases. 2. Pyrido[3,4-d]pyrimidin-4(3H)-one Derivatives. J Med Chem59:1370-87 (2016) 
 
Lysine-specific demethylase 4C
Name:Lysine-specific demethylase 4C
Type:Protein
Mol. Mass.:119979.01
Organism:Homo sapiens (Human)
Description:Q9H3R0
Residue:1056
BDBM50149918
NameBDBM50149918
Synonyms:CHEMBL3769853
TypeSmall organic molecule
Emp. Form.C17H19N5O2
Mol. Mass.325.3651
SMILESO=c1[nH]c(Oc2cnn(c2)C2CCCCCC2)nc2cnccc12