Reaction Details
TargetAcetylcholinesterase
LigandBDBM50149950
Substrate/Competitorn/a
Meas. Tech.ChEMBL_1558461 (CHEMBL3773337)
IC50 92200±n/a nM
Citation Pejchal, V?tepánková, ?Pejchalová, MKrálovec, KHavelek, RRu?icková, ZAjani, HLo, RLep?ík, M Synthesis, structural characterization, docking, lipophilicity and cytotoxicity of 1-[(1R)-1-(6-fluoro-1,3-benzothiazol-2-yl)ethyl]-3-alkyl carbamates, novel acetylcholinesterase and butyrylcholinesterase pseudo-irreversible inhibitors. Bioorg Med Chem24:1560-72 (2016) 
 
Acetylcholinesterase
Name:Acetylcholinesterase
Type:Enzyme
Mol. Mass.:71812.79
Organism:Electrophorus electricus (Electric eel)
Description:n/a
Residue:633
BDBM50149950
NameBDBM50149950
Synonyms:CHEMBL3770572
TypeSmall organic molecule
Emp. Form.C12H10Cl3FN2O2S
Mol. Mass.371.642
SMILESC[C@@H](NC(=O)OCC(Cl)(Cl)Cl)c1nc2ccc(F)cc2s1