Reaction Details
TargetBromodomain testis-specific protein
LigandBDBM50150069
Substrate/Competitorn/a
Meas. Tech.ChEBML_1561956
IC50 100000±n/a nM
Citation Raux, BVoitovich, YDerviaux, CLugari, ARebuffet, EMilhas, SPriet, SRoux, TTrinquet, EGuillemot, JCKnapp, SBrunel, JMFedorov, AYCollette, YRoche, PBetzi, SCombes, SMorelli, X Exploring Selective Inhibition of the First Bromodomain of the Human Bromodomain and Extra-terminal Domain (BET) Proteins. J Med Chem59:1634-41 (2016) 
 
Bromodomain testis-specific protein
Name:Bromodomain testis-specific protein
Type:PROTEIN
Mol. Mass.:107982.01
Organism:Homo sapiens (Human)
Description:ChEMBL_1502985
Residue:947
BDBM50150069
NameBDBM50150069
Synonyms:CHEMBL3774931
TypeSmall organic molecule
Emp. Form.C23H32N8O2S
Mol. Mass.484.618
SMILESCCCCc1c(C)nc2nc(SCc3nc4n(CCCC)c(=O)[nH]c(=O)c4n3CC)nn2c1C