Reaction Details
TargetBromodomain-containing protein 3
LigandBDBM50150754
Substrate/Competitorn/a
Meas. Tech.ChEMBL_1561958 (CHEMBL3778794)
IC50 1800±n/a nM
Citation Raux, BVoitovich, YDerviaux, CLugari, ARebuffet, EMilhas, SPriet, SRoux, TTrinquet, EGuillemot, JCKnapp, SBrunel, JMFedorov, AYCollette, YRoche, PBetzi, SCombes, SMorelli, X Exploring Selective Inhibition of the First Bromodomain of the Human Bromodomain and Extra-terminal Domain (BET) Proteins. J Med Chem59:1634-41 (2016) 
 
Bromodomain-containing protein 3
Name:Bromodomain-containing protein 3
Type:Protein
Mol. Mass.:79571.81
Organism:Homo sapiens (Human)
Description:Q15059
Residue:726
BDBM50150754
NameBDBM50150754
Synonyms:CHEMBL3775058
TypeSmall organic molecule
Emp. Form.C14H13ClN4O2
Mol. Mass.304.732
SMILESCCn1cnc2n(Cc3ccc(Cl)cc3)c(=O)[nH]c(=O)c12