Reaction Details
TargetBeta-galactosidase
LigandBDBM50150470
Substrate/Competitorn/a
Meas. Tech.ChEMBL_1558588 (CHEMBL3774077)
IC50 210±n/a nM
Citation Thonhofer, MWeber, PSantana, AGFischer, RPabst, BMPaschke, ESchalli, MStütz, AETschernutter, MWindischhofer, WWithers, SG Synthesis of C-5a-chain extended derivatives of 4-epi-isofagomine: Powerfulß-galactosidase inhibitors and low concentration activators of GM1-gangliosidosis-related human lysosomalß-galactosidase. Bioorg Med Chem Lett26:1438-42 (2016) 
 
Beta-galactosidase
Name:Beta-galactosidase
Type:PROTEIN
Mol. Mass.:76074.43
Organism:Homo sapiens (Human)
Description:ChEMBL_215886
Residue:677
BDBM50150470
NameBDBM50150470
Synonyms:CHEMBL3771185
TypeSmall organic molecule
Emp. Form.C22H33N3O5S
Mol. Mass.451.58
SMILESCN(C)c1cccc2c(cccc12)S(=O)(=O)NCCCC[C@H]1NC[C@@H](O)[C@@H](O)[C@H]1CO