Reaction Details
TargetBeta-galactosidase
LigandBDBM50358321
Substrate/Competitorn/a
Meas. Tech.ChEMBL_1558582 (CHEMBL3774071)
Ki 870±n/a nM
Citation Thonhofer, MWeber, PSantana, AGFischer, RPabst, BMPaschke, ESchalli, MStütz, AETschernutter, MWindischhofer, WWithers, SG Synthesis of C-5a-chain extended derivatives of 4-epi-isofagomine: Powerfulß-galactosidase inhibitors and low concentration activators of GM1-gangliosidosis-related human lysosomalß-galactosidase. Bioorg Med Chem Lett26:1438-42 (2016) 
 
Beta-galactosidase
Name:Beta-galactosidase
Type:Protein
Mol. Mass.:73420.88
Organism:Bos taurus (Bovine)
Description:n/a
Residue:653
BDBM50358321
NameBDBM50358321
Synonyms:CHEMBL1922579 | CHEMBL1922581
TypeSmall organic molecule
Emp. Form.C15H29NO4
Mol. Mass.287.3951
SMILESCCCCCCCCN[C@@H]1C=C(CO)[C@H](O)[C@H](O)[C@H]1O