Reaction Details
TargetBeta-galactosidase
LigandBDBM50150470
Substrate/Competitorn/a
Meas. Tech.ChEMBL_1558579 (CHEMBL3774068)
Ki 13±n/a nM
Citation Thonhofer, MWeber, PSantana, AGFischer, RPabst, BMPaschke, ESchalli, MStütz, AETschernutter, MWindischhofer, WWithers, SG Synthesis of C-5a-chain extended derivatives of 4-epi-isofagomine: Powerfulß-galactosidase inhibitors and low concentration activators of GM1-gangliosidosis-related human lysosomalß-galactosidase. Bioorg Med Chem Lett26:1438-42 (2016) 
 
Beta-galactosidase
Name:Beta-galactosidase
Type:Protein
Mol. Mass.:73420.88
Organism:Bos taurus (Bovine)
Description:n/a
Residue:653
BDBM50150470
NameBDBM50150470
Synonyms:CHEMBL3771185
TypeSmall organic molecule
Emp. Form.C22H33N3O5S
Mol. Mass.451.58
SMILESCN(C)c1cccc2c(cccc12)S(=O)(=O)NCCCC[C@H]1NC[C@@H](O)[C@@H](O)[C@H]1CO