Reaction Details
TargetBeta-galactosidase
LigandBDBM50350758
Substrate/Competitorn/a
Meas. Tech.ChEMBL_1558578 (CHEMBL3774067)
Ki 31±n/a nM
Citation Thonhofer, MWeber, PSantana, AGFischer, RPabst, BMPaschke, ESchalli, MStütz, AETschernutter, MWindischhofer, WWithers, SG Synthesis of C-5a-chain extended derivatives of 4-epi-isofagomine: Powerfulß-galactosidase inhibitors and low concentration activators of GM1-gangliosidosis-related human lysosomalß-galactosidase. Bioorg Med Chem Lett26:1438-42 (2016) 
 
Beta-galactosidase
Name:Beta-galactosidase
Type:PROTEIN
Mol. Mass.:116943.87
Organism:Escherichia coli
Description:ChEMBL_215882
Residue:1029
BDBM50350758
NameBDBM50350758
Synonyms:CHEMBL1818433
TypeSmall organic molecule
Emp. Form.C6H13NO3
Mol. Mass.147.1723
SMILESOC[C@H]1CNC[C@@H](O)[C@H]1O