Reaction Details
TargetN-acylethanolamine-hydrolyzing acid amidase
LigandBDBM50151148
Substrate/Competitorn/a
Meas. Tech.ChEBML_1558879
IC50 130±n/a nM
Citation Nuzzi, AFiasella, AOrtega, JAPagliuca, CPonzano, SPizzirani, DBertozzi, SMOttonello, GTarozzo, GReggiani, ABandiera, TBertozzi, FPiomelli, D Potenta-amino-ß-lactam carbamic acid ester as NAAA inhibitors. Synthesis and structure-activity relationship (SAR) studies. Eur J Med Chem111:138-59 (2016) 
 
N-acylethanolamine-hydrolyzing acid amidase
Name:N-acylethanolamine-hydrolyzing acid amidase
Type:Enzyme
Mol. Mass.:40073.12
Organism:Homo sapiens (Human)
Description:Q02083
Residue:359
BDBM50151148
NameBDBM50151148
Synonyms:CHEMBL3769700
TypeSmall organic molecule
Emp. Form.C14H16N2O3
Mol. Mass.260.2884
SMILESO=C(N[C@H]1CNC1=O)OCc1ccc2CCCc2c1