Reaction Details
TargetN-acylethanolamine-hydrolyzing acid amidase
LigandBDBM50151155
Substrate/Competitorn/a
Meas. Tech.ChEMBL_1558879 (CHEMBL3772811)
IC50 33±n/a nM
Citation Nuzzi, AFiasella, AOrtega, JAPagliuca, CPonzano, SPizzirani, DBertozzi, SMOttonello, GTarozzo, GReggiani, ABandiera, TBertozzi, FPiomelli, D Potenta-amino-ß-lactam carbamic acid ester as NAAA inhibitors. Synthesis and structure-activity relationship (SAR) studies. Eur J Med Chem111:138-59 (2016) 
 
N-acylethanolamine-hydrolyzing acid amidase
Name:N-acylethanolamine-hydrolyzing acid amidase
Type:Enzyme
Mol. Mass.:40073.12
Organism:Homo sapiens (Human)
Description:Q02083
Residue:359
BDBM50151155
NameBDBM50151155
Synonyms:CHEMBL3769844
TypeSmall organic molecule
Emp. Form.C13H22N2O3
Mol. Mass.254.3254
SMILESO=C(N[C@H]1CNC1=O)OCCCCC1CCCC1