Reaction Details
TargetTranscription intermediary factor 1-alpha
LigandBDBM50150759
Substrate/Competitorn/a
Meas. Tech.ChEMBL_1560318 (CHEMBL3779310)
IC50 160±n/a nM
Citation Palmer, WSPoncet-Montange, GLiu, GPetrocchi, AReyna, NSubramanian, GTheroff, JYau, AKost-Alimova, MBardenhagen, JPLeo, EShepard, HETieu, TNShi, XZhan, YZhao, SBarton, MCDraetta, GToniatti, CJones, PGeck Do, MAndersen, JN Structure-Guided Design of IACS-9571, a Selective High-Affinity Dual TRIM24-BRPF1 Bromodomain Inhibitor. J Med Chem59:1440-54 (2016) 
 
Transcription intermediary factor 1-alpha
Name:Transcription intermediary factor 1-alpha
Type:PROTEIN
Mol. Mass.:116839.55
Organism:Homo sapiens (Human)
Description:ChEMBL_107998
Residue:1050
BDBM50150759
NameBDBM50150759
Synonyms:CHEMBL3774638
TypeSmall organic molecule
Emp. Form.C33H46N6O8S
Mol. Mass.686.819
SMILESCCCOc1cc(OCCCCCCNC(=O)OC(C)(C)C)cc(Oc2cc3n(C)c(=O)n(C)c3cc2NS(=O)(=O)c2cn(C)cn2)c1