Reaction Details
TargetTranscription intermediary factor 1-alpha
LigandBDBM50150814
Substrate/Competitorn/a
Meas. Tech.ChEMBL_1560318 (CHEMBL3779310)
IC50 270±n/a nM
Citation Palmer, WSPoncet-Montange, GLiu, GPetrocchi, AReyna, NSubramanian, GTheroff, JYau, AKost-Alimova, MBardenhagen, JPLeo, EShepard, HETieu, TNShi, XZhan, YZhao, SBarton, MCDraetta, GToniatti, CJones, PGeck Do, MAndersen, JN Structure-Guided Design of IACS-9571, a Selective High-Affinity Dual TRIM24-BRPF1 Bromodomain Inhibitor. J Med Chem59:1440-54 (2016) 
 
Transcription intermediary factor 1-alpha
Name:Transcription intermediary factor 1-alpha
Type:PROTEIN
Mol. Mass.:116839.55
Organism:Homo sapiens (Human)
Description:ChEMBL_107998
Residue:1050
BDBM50150814
NameBDBM50150814
Synonyms:CHEMBL3775640
TypeSmall organic molecule
Emp. Form.C27H27N5O5S
Mol. Mass.533.599
SMILESCc1nc(cn1C)S(=O)(=O)Nc1cc2n(C)c(=O)n(C)c2cc1Oc1cccc(OCc2ccccc2)c1