Reaction Details
TargetTranscription intermediary factor 1-alpha
LigandBDBM50148479
Substrate/Competitorn/a
Meas. Tech.ChEMBL_1560318 (CHEMBL3779310)
IC50 1500±n/a nM
Citation Palmer, WSPoncet-Montange, GLiu, GPetrocchi, AReyna, NSubramanian, GTheroff, JYau, AKost-Alimova, MBardenhagen, JPLeo, EShepard, HETieu, TNShi, XZhan, YZhao, SBarton, MCDraetta, GToniatti, CJones, PGeck Do, MAndersen, JN Structure-Guided Design of IACS-9571, a Selective High-Affinity Dual TRIM24-BRPF1 Bromodomain Inhibitor. J Med Chem59:1440-54 (2016) 
 
Transcription intermediary factor 1-alpha
Name:Transcription intermediary factor 1-alpha
Type:PROTEIN
Mol. Mass.:116839.55
Organism:Homo sapiens (Human)
Description:ChEMBL_107998
Residue:1050
BDBM50148479
NameBDBM50148479
Synonyms:CHEMBL3770259
TypeSmall organic molecule
Emp. Form.C22H21N3O5S
Mol. Mass.439.484
SMILESCOc1ccc(Oc2cc3n(C)c(=O)n(C)c3cc2NS(=O)(=O)c2ccccc2)cc1