Reaction Details
TargetTranscription intermediary factor 1-alpha
LigandBDBM50150874
Substrate/Competitorn/a
Meas. Tech.ChEMBL_1560318 (CHEMBL3779310)
IC50 2500±n/a nM
Citation Palmer, WSPoncet-Montange, GLiu, GPetrocchi, AReyna, NSubramanian, GTheroff, JYau, AKost-Alimova, MBardenhagen, JPLeo, EShepard, HETieu, TNShi, XZhan, YZhao, SBarton, MCDraetta, GToniatti, CJones, PGeck Do, MAndersen, JN Structure-Guided Design of IACS-9571, a Selective High-Affinity Dual TRIM24-BRPF1 Bromodomain Inhibitor. J Med Chem59:1440-54 (2016) 
 
Transcription intermediary factor 1-alpha
Name:Transcription intermediary factor 1-alpha
Type:PROTEIN
Mol. Mass.:116839.55
Organism:Homo sapiens (Human)
Description:ChEMBL_107998
Residue:1050
BDBM50150874
NameBDBM50150874
Synonyms:CHEMBL3775559
TypeSmall organic molecule
Emp. Form.C18H20N2O5S
Mol. Mass.376.427
SMILESCOc1ccc(c(OC)c1)S(=O)(=O)Nc1ccc2N(C)C(=O)CCc2c1