Reaction Details
TargetOxidized purine nucleoside triphosphate hydrolase
LigandBDBM50152139
Substrate/Competitorn/a
Meas. Tech.ChEMBL_1565467 (CHEMBL3782136)
IC50 10.0±n/a nM
Citation Petrocchi, ALeo, EReyna, NJHamilton, MMShi, XParker, CAMseeh, FBardenhagen, JPLeonard, PCross, JBHuang, SJiang, YCardozo, MDraetta, GMarszalek, JRToniatti, CJones, PLewis, RT Identification of potent and selective MTH1 inhibitors. Bioorg Med Chem Lett26:1503-7 (2016) 
 
Oxidized purine nucleoside triphosphate hydrolase
Name:Oxidized purine nucleoside triphosphate hydrolase
Type:Protein
Mol. Mass.:22514.81
Organism:Homo sapiens (Human)
Description:P36639
Residue:156
BDBM50152139
NameBDBM50152139
Synonyms:CHEMBL3780307
TypeSmall organic molecule
Emp. Form.C10H17N3O3
Mol. Mass.227.2603
SMILESCOc1cnc(N)nc1OCC(C)(C)CO