Reaction Details
TargetSolute carrier family 2, facilitated glucose transporter member 3
LigandBDBM50152744
Substrate/Competitorn/a
Meas. Tech.ChEMBL_1565338 (CHEMBL3782732)
IC50 480±n/a nM
Citation Siebeneicher, HBauser, MBuchmann, BHeisler, IMüller, TNeuhaus, RRehwinkel, HTelser, JZorn, L Identification of novel GLUT inhibitors. Bioorg Med Chem Lett26:1732-7 (2016) 
 
Solute carrier family 2, facilitated glucose transporter member 3
Name:Solute carrier family 2, facilitated glucose transporter member 3
Type:PROTEIN
Mol. Mass.:53925.15
Organism:Homo sapiens (Human)
Description:ChEMBL_101113
Residue:496
BDBM50152744
NameBDBM50152744
Synonyms:CHEMBL3781633
TypeSmall organic molecule
Emp. Form.C23H24N6O
Mol. Mass.400.4763
SMILESCOc1ccccc1N1CCN(C(C)C1)c1ncnc2n(ncc12)-c1ccccc1