Reaction Details
TargetSolute carrier family 2, facilitated glucose transporter member 2
LigandBDBM50155752
Substrate/Competitorn/a
Meas. Tech.ChEMBL_1565337 (CHEMBL3782731)
IC50 2000±n/a nM
Citation Siebeneicher, HBauser, MBuchmann, BHeisler, IMüller, TNeuhaus, RRehwinkel, HTelser, JZorn, L Identification of novel GLUT inhibitors. Bioorg Med Chem Lett26:1732-7 (2016) 
 
Solute carrier family 2, facilitated glucose transporter member 2
Name:Solute carrier family 2, facilitated glucose transporter member 2
Type:PROTEIN
Mol. Mass.:57494.38
Organism:Homo sapiens (Human)
Description:ChEMBL_599700
Residue:524
BDBM50155752
NameBDBM50155752
Synonyms:CHEMBL3780527
TypeSmall organic molecule
Emp. Form.C21H26N6O
Mol. Mass.378.4707
SMILESCOc1ccccc1N1CCN(CC1)c1ncnc2n(ncc12)C1CCCC1