Reaction Details
TargetSolute carrier family 2, facilitated glucose transporter member 2
LigandBDBM50152746
Substrate/Competitorn/a
Meas. Tech.ChEMBL_1565337 (CHEMBL3782731)
IC50>10000±n/a nM
Citation Siebeneicher, HBauser, MBuchmann, BHeisler, IMüller, TNeuhaus, RRehwinkel, HTelser, JZorn, L Identification of novel GLUT inhibitors. Bioorg Med Chem Lett26:1732-7 (2016) 
 
Solute carrier family 2, facilitated glucose transporter member 2
Name:Solute carrier family 2, facilitated glucose transporter member 2
Type:PROTEIN
Mol. Mass.:57494.38
Organism:Homo sapiens (Human)
Description:ChEMBL_599700
Residue:524
BDBM50152746
NameBDBM50152746
Synonyms:CHEMBL3780119
TypeSmall organic molecule
Emp. Form.C23H22N6O
Mol. Mass.398.4604
SMILES[H][C@@]12CN(c3ncnc4n(ncc34)-c3ccccc3)[C@@]([H])(CN1c1ccccc1OC)C2