Reaction Details
TargetSolute carrier family 2, facilitated glucose transporter member 2
LigandBDBM50155685
Substrate/Competitorn/a
Meas. Tech.ChEMBL_1565337 (CHEMBL3782731)
IC50>10000±n/a nM
Citation Siebeneicher, HBauser, MBuchmann, BHeisler, IMüller, TNeuhaus, RRehwinkel, HTelser, JZorn, L Identification of novel GLUT inhibitors. Bioorg Med Chem Lett26:1732-7 (2016) 
 
Solute carrier family 2, facilitated glucose transporter member 2
Name:Solute carrier family 2, facilitated glucose transporter member 2
Type:PROTEIN
Mol. Mass.:57494.38
Organism:Homo sapiens (Human)
Description:ChEMBL_599700
Residue:524
BDBM50155685
NameBDBM50155685
Synonyms:CHEMBL3780403
TypeSmall organic molecule
Emp. Form.C22H19F3N6O
Mol. Mass.440.4211
SMILESFC(F)(F)Oc1ccccc1N1CCN(CC1)c1ncnc2n(ncc12)-c1ccccc1