Reaction Details
TargetSolute carrier family 2, facilitated glucose transporter member 3
LigandBDBM50152766
Substrate/Competitorn/a
Meas. Tech.ChEMBL_1565338 (CHEMBL3782732)
IC50 2000±n/a nM
Citation Siebeneicher, HBauser, MBuchmann, BHeisler, IMüller, TNeuhaus, RRehwinkel, HTelser, JZorn, L Identification of novel GLUT inhibitors. Bioorg Med Chem Lett26:1732-7 (2016) 
 
Solute carrier family 2, facilitated glucose transporter member 3
Name:Solute carrier family 2, facilitated glucose transporter member 3
Type:PROTEIN
Mol. Mass.:53925.15
Organism:Homo sapiens (Human)
Description:ChEMBL_101113
Residue:496
BDBM50152766
NameBDBM50152766
Synonyms:CHEMBL3781757
TypeSmall organic molecule
Emp. Form.C23H23N5O
Mol. Mass.385.4616
SMILESCOc1ccccc1N1CCN(CC1)c1nccc2n(ncc12)-c1ccccc1