Reaction Details
TargetSodium/glucose cotransporter 2
LigandBDBM50315426
Substrate/Competitorn/a
Meas. Tech.ChEMBL_1563453 (CHEMBL3783046)
Ki 1.1±n/a nM
Citation Flick, ACDing, HXLeverett, CAKyne, RELiu, KKFink, SJO'Donnell, CJ Synthetic approaches to the 2014 new drugs. Bioorg Med Chem24:1937-80 (2016) 
 
Sodium/glucose cotransporter 2
Name:Sodium/glucose cotransporter 2
Type:Protein
Mol. Mass.:72902.00
Organism:Homo sapiens (Human)
Description:P31639
Residue:672
BDBM50315426
NameBDBM50315426
Synonyms:(1S)-1,5-Anhydro-1-[5-(4-ethoxybenzyl)-2-methoxy-4-methylphenyl]-1-thio-D-glucitol | CHEMBL1093423
TypeSmall organic molecule
Emp. Form.C23H30O6S
Mol. Mass.434.546
SMILESCCOc1ccc(Cc2cc([C@@H]3S[C@H](CO)[C@@H](O)[C@H](O)[C@H]3O)c(OC)cc2C)cc1