Reaction Details
TargetD(3) dopamine receptor
LigandBDBM50152840
Substrate/Competitorn/a
Meas. Tech.ChEMBL_1563481 (CHEMBL3783166)
Ki 1367±n/a nM
Citation Gadhiya, SMadapa, SKurtzman, TAlberts, ILRamsey, SPillarsetty, NKKalidindi, THarding, WW Tetrahydroprotoberberine alkaloids with dopamine ands receptor affinity. Bioorg Med Chem24:2060-71 (2016) 
 
D(3) dopamine receptor
Name:D(3) dopamine receptor
Type:n/a
Mol. Mass.:44243.43
Organism:Homo sapiens (Human)
Description:n/a
Residue:400
BDBM50152840
NameBDBM50152840
Synonyms:CHEMBL3780975
TypeSmall organic molecule
Emp. Form.C19H23NO4
Mol. Mass.329.3902
SMILESCOc1cc2CCN(Cc3cccc(O)c3OC)C(C)c2cc1O