Reaction Details
TargetD(3) dopamine receptor
LigandBDBM50152841
Substrate/Competitorn/a
Meas. Tech.ChEMBL_1563481 (CHEMBL3783166)
Ki 54±n/a nM
Citation Gadhiya, SMadapa, SKurtzman, TAlberts, ILRamsey, SPillarsetty, NKKalidindi, THarding, WW Tetrahydroprotoberberine alkaloids with dopamine ands receptor affinity. Bioorg Med Chem24:2060-71 (2016) 
 
D(3) dopamine receptor
Name:D(3) dopamine receptor
Type:n/a
Mol. Mass.:44243.43
Organism:Homo sapiens (Human)
Description:n/a
Residue:400
BDBM50152841
NameBDBM50152841
Synonyms:CHEMBL3780184
TypeSmall organic molecule
Emp. Form.C23H27NO4
Mol. Mass.381.4648
SMILESCOc1cc2CCN3Cc4c(CC3c2cc1O)ccc(OCC1CC1)c4OC