Reaction Details
TargetD(2) dopamine receptor
LigandBDBM50152839
Substrate/Competitorn/a
Meas. Tech.ChEMBL_1563480 (CHEMBL3783165)
Ki>10000±n/a nM
Citation Gadhiya, SMadapa, SKurtzman, TAlberts, ILRamsey, SPillarsetty, NKKalidindi, THarding, WW Tetrahydroprotoberberine alkaloids with dopamine ands receptor affinity. Bioorg Med Chem24:2060-71 (2016) 
 
D(2) dopamine receptor
Name:D(2) dopamine receptor
Type:Cell-surface receptors
Mol. Mass.:50647.10
Organism:Homo sapiens (Human)
Description:P14416
Residue:443
BDBM50152839
NameBDBM50152839
Synonyms:CHEMBL3780438
TypeSmall organic molecule
Emp. Form.C18H23NO4
Mol. Mass.317.3795
SMILESCOc1cc(CCN(C)Cc2cccc(O)c2OC)ccc1O