Reaction Details
TargetD(2) dopamine receptor
LigandBDBM50152837
Substrate/Competitorn/a
Meas. Tech.ChEMBL_1563480 (CHEMBL3783165)
Ki 116±n/a nM
Citation Gadhiya, SMadapa, SKurtzman, TAlberts, ILRamsey, SPillarsetty, NKKalidindi, THarding, WW Tetrahydroprotoberberine alkaloids with dopamine ands receptor affinity. Bioorg Med Chem24:2060-71 (2016) 
 
D(2) dopamine receptor
Name:D(2) dopamine receptor
Type:Cell-surface receptors
Mol. Mass.:50647.10
Organism:Homo sapiens (Human)
Description:P14416
Residue:443
BDBM50152837
NameBDBM50152837
Synonyms:CHEMBL595489
TypeSmall organic molecule
Emp. Form.C19H21NO4
Mol. Mass.327.3743
SMILESCOc1cc2CCN3Cc4c(CC3c2cc1O)ccc(O)c4OC