Reaction Details
TargetSigma non-opioid intracellular receptor 1
LigandBDBM50152842
Substrate/Competitorn/a
Meas. Tech.ChEMBL_1563482 (CHEMBL3783167)
Ki 53±n/a nM
Citation Gadhiya, SMadapa, SKurtzman, TAlberts, ILRamsey, SPillarsetty, NKKalidindi, THarding, WW Tetrahydroprotoberberine alkaloids with dopamine ands receptor affinity. Bioorg Med Chem24:2060-71 (2016) 
 
Sigma non-opioid intracellular receptor 1
Name:Sigma non-opioid intracellular receptor 1
Type:Enzyme Catalytic Domain
Mol. Mass.:25124.85
Organism:Homo sapiens (Human)
Description:Q99720
Residue:223
BDBM50152842
NameBDBM50152842
Synonyms:CHEMBL3780268
TypeSmall organic molecule
Emp. Form.C22H27NO5
Mol. Mass.385.4535
SMILESCOc1cc2CCN3Cc4c(CC3c2cc1O)ccc(OCCCO)c4OC