Reaction Details
TargetQuinolone resistance protein NorA
LigandBDBM50153182
Substrate/Competitorn/a
Meas. Tech.ChEMBL_1562415 (CHEMBL3778151)
IC50 6700±n/a nM
Citation Lepri, SBuonerba, FGoracci, LVelilla, IRuzziconi, RSchindler, BDSeo, SMKaatz, GWCruciani, G Indole Based Weapons to Fight Antibiotic Resistance: A Structure-Activity Relationship Study. J Med Chem59:867-91 (2016) 
 
Quinolone resistance protein NorA
Name:Quinolone resistance protein NorA
Type:PROTEIN
Mol. Mass.:42273.03
Organism:Staphylococcus aureus
Description:ChEMBL_961221
Residue:388
BDBM50153182
NameBDBM50153182
Synonyms:CHEMBL3775053
TypeSmall organic molecule
Emp. Form.C28H36N2O3
Mol. Mass.448.597
SMILESCCOC(=O)c1c(C)n(Cc2ccc(C)cc2)c2ccc(OCCCN3CCCCC3)cc12